BDBM50301255 2-(4-(4-(2-(2-hydroxy-2-(5-hydroxy-3-oxo-3,4-dihydro-2H-benzo[b][1,4]oxazin-8-yl)ethylamino)-2-methylpropyl)phenylamino)-4-oxobutylamino)-N,N,N-trimethyl-2-oxoethanaminium::CHEMBL587197
SMILES CC(C)(Cc1ccc(NC(=O)CCCNC(=O)C[N+](C)(C)C)cc1)NCC(O)c1ccc(O)c2NC(=O)COc12
InChI Key InChIKey=LBHBNLPSDBCGLA-UHFFFAOYSA-O
Data  2 EC50
  Tab Delimited (TSV)   2D SDfile   Computed 3D by Vconf -m prep SDfile
Find this compound or compounds like it in BindingDB:
Activity Spreadsheet -- Enzyme Inhibition Constant Data from BindingDB
Found 1 hit for monomerid = 50301255
TargetBeta-1 adrenergic receptor(Homo sapiens (Human))
Boehringer Ingelheim Pharma
Curated by ChEMBL
LigandPNGBDBM50301255(2-(4-(4-(2-(2-hydroxy-2-(5-hydroxy-3-oxo-3,4-dihyd...)
Affinity DataEC50:  3.5nM. Assay description: Agonist activity at human beta-1 adrenoceptor expressed in CHOK1 cell assessed as increase of intracellular cAMP level
In DepthDetails ArticlePubMed